0024677: Control of license statements and non-ascii characters in integrated code
[occt.git] / dox / dev_guides / tests / tests.md
ba06f8bb 1 Automated Testing System {#occt_dev_guides__tests}
72b7576f 2======================================
e5bd0d98 4@tableofcontents
dcc0a33e 6@section testmanual_intro Introduction
72b7576f 7
504a8968 8This document provides OCCT developers and contributors with an overview and practical guidelines for work with OCCT automatic testing system.
6d368502 10Reading the Introduction should be sufficient for developers to use the test system to control non-regression of the modifications they implement in OCCT. Other sections provide a more in-depth description of the test system, required for modifying the tests and adding new test cases.
72b7576f 11
dcc0a33e 12@subsection testmanual_intro_basic Basic Information
72b7576f 13
9d99d3c1 14OCCT automatic testing system is organized around @ref occt_user_guides__test_harness "DRAW Test Harness", a console application based on Tcl (a scripting language) interpreter extended by OCCT-related commands.
e5bd0d98 15
504a8968 16Standard OCCT tests are included with OCCT sources and are located in subdirectory *tests* of the OCCT root folder. Other test folders can be included in the test system, e.g. for testing applications based on OCCT.
e5bd0d98 17
504a8968 18The tests are organized in three levels:
72b7576f 19
504a8968 20 * Group: a group of related test grids, usually testing a particular OCCT functionality (e.g. blend);
21 * Grid: a set of test cases within a group, usually aimed at testing some particular aspect or mode of execution of the relevant functionality (e.g. buildevol);
22 * Test case: a script implementing an individual test (e.g. K4).
67d7f07f 24See @ref testmanual_5_1 "Test Groups" chapter for the current list of available test groups and grids.
72b7576f 25
936f43da 26Some tests involve data files (typically CAD models) which are located separately and are not included with OCCT code. The archive with publicly available test data files should be downloaded and installed independently on OCCT sources (see http://dev.opencascade.org).
72b7576f 27
28@subsection testmanual_1_2 Intended Use of Automatic Tests
30Each modification made in OCCT code must be checked for non-regression
6d368502 31by running the whole set of tests. The developer who makes the modification
504a8968 32is responsible for running and ensuring non-regression for the tests available to him.
6d368502 34Note that many tests are based on data files that are confidential and thus available only at OPEN CASCADE.
35The official certification testing of each change before its integration to master branch of official OCCT Git repository (and finally to the official release) is performed by OPEN CASCADE to ensure non-regression on all existing test cases and supported platforms.
504a8968 36
37Each new non-trivial modification (improvement, bug fix, new feature) in OCCT should be accompanied by a relevant test case suitable for verifying that modification. This test case is to be added by the developer who provides the modification.
72b7576f 38
504a8968 39If a modification affects the result of an existing test case, either the modification should be corrected (if it causes regression) or the affected test cases should be updated to account for the modification.
72b7576f 40
504a8968 41The modifications made in the OCCT code and related test scripts should be included in the same integration to the master branch.
72b7576f 42
43@subsection testmanual_1_3 Quick Start
45@subsubsection testmanual_1_3_1 Setup
504a8968 47Before running tests, make sure to define environment variable *CSF_TestDataPath* pointing to the directory containing test data files.
504a8968 48
49For this it is recommended to add a file *DrawAppliInit* in the directory which is current at the moment of starting DRAWEXE (normally it is OCCT root directory, <i>$CASROOT </i>). This file is evaluated automatically at the DRAW start.
51Example (Windows)
72b7576f 52
6d368502 53~~~~~{.tcl}
504a8968 54set env(CSF_TestDataPath) $env(CSF_TestDataPath)\;d:/occt/test-data
6d368502 55~~~~~
504a8968 56
504a8968 57Note that variable *CSF_TestDataPath* is set to default value at DRAW start, pointing at the folder <i>$CASROOT/data</i>.
87f42a3f 58In this example, subdirectory <i>d:/occt/test-data</i> is added to this path. Similar code could be used on Linux and Mac OS X except that on non-Windows platforms colon ":" should be used as path separator instead of semicolon ";".
72b7576f 59
936f43da 60All tests are run from DRAW command prompt (run *draw.bat* or *draw.sh* to start it).
72b7576f 61
62@subsubsection testmanual_1_3_2 Running Tests
504a8968 64To run all tests, type command *testgrid*
72b7576f 65
504a8968 68~~~~~
69Draw[]> testgrid
72b7576f 71
ae3eaf7b 72To run only a subset of test cases, give masks for group, grid, and test case names to be executed.
73Each argument is a list of file masks separated with commas or spaces; by default "*" is assumed.
72b7576f 74
504a8968 75Example:
72b7576f 76
504a8968 77~~~~~
87f42a3f 78Draw[]> testgrid bugs caf,moddata*,xde
504a8968 79~~~~~
72b7576f 80
72b7576f 81As the tests progress, the result of each test case is reported.
504a8968 82At the end of the log a summary of test cases is output,
83including the list of detected regressions and improvements, if any.
72b7576f 84
504a8968 86Example:
72b7576f 88~~~~~~~~~~~~~~~~~~~~~~~~~~~~~~~~~~~~~~~~~~~~~~~~~~~~~~~~~~~~~~~~~~~~~{.tcl}
89 Tests summary
91 CASE 3rdparty export A1: OK
92 ...
93 CASE pipe standard B1: BAD (known problem)
94 CASE pipe standard C1: OK
95 No regressions
96 Total cases: 208 BAD, 31 SKIPPED, 3 IMPROVEMENT, 1791 OK
97 Elapsed time: 1 Hours 14 Minutes 33.7384512019 Seconds
98 Detailed logs are saved in D:/occt/results_2012-06-04T0919
dcc0a33e 101The tests are considered as non-regressive if only OK, BAD (i.e. known problem), and SKIPPED (i.e. not executed, typically because of lack of a data file) statuses are reported. See @ref testmanual_details_results "Interpretation of test results" for details.
72b7576f 102
936f43da 103The results and detailed logs of the tests are saved by default to a new subdirectory of the subdirectory *results* in the current folder, whose name is generated automatically using the current date and time, prefixed by Git branch name (if Git is available and current sources are managed by Git).
ae3eaf7b 104If necessary, a non-default output directory can be specified using option <i> –outdir</i> followed by a path to the directory. This directory should be new or empty; use option <i>–overwrite</i> to allow writing results in the existing non-empty directory.
72b7576f 105
504a8968 106Example:
87f42a3f 108Draw[]> testgrid -outdir d:/occt/last_results -overwrite
504a8968 109~~~~~
ae3eaf7b 110In the output directory, a cumulative HTML report <i>summary.html</i> provides links to reports on each test case. An additional report in JUnit-style XML format can be output for use in Jenkins or other continuous integration system.
504a8968 111
b502ddc1 112To re-run test cases which were detected as regressions on previous run, option <i>-regress dirname</i> should be used.
113<i>dirname</i> is path to directory containing results of previous run. Only test cases with *FAILED* and *IMPROVEMENT* statuses will be tested.
117Draw[]> testgrid -regress d:/occt/last_results
936f43da 120Type <i>help testgrid</i> in DRAW prompt to get help on options supported by *testgrid* command:
72b7576f 121
504a8968 122~~~~~
123Draw[3]> help testgrid
124testgrid: Run all tests, or specified group, or one grid
87f42a3f 125 Use: testgrid [groupmask [gridmask [casemask]]] [options...]
504a8968 126 Allowed options are:
127 -parallel N: run N parallel processes (default is number of CPUs, 0 to disable)
128 -refresh N: save summary logs every N seconds (default 60, minimal 1, 0 to disable)
129 -outdir dirname: set log directory (should be empty or non-existing)
130 -overwrite: force writing logs in existing non-empty directory
131 -xml filename: write XML report for Jenkins (in JUnit-like format)
936f43da 132 -beep: play sound signal at the end of the tests
b502ddc1 133 -regress dirname: re-run only a set of tests that have been detected as regressions on some previous run.
134 Here "dirname" is path to directory containing results of previous run.
87f42a3f 135 Groups, grids, and test cases to be executed can be specified by list of file
136 masks, separated by spaces or comma; default is all (*).
504a8968 137~~~~~
72b7576f 138
504a8968 139@subsubsection testmanual_1_3_3 Running a Single Test
87f42a3f 141To run a single test, type command *test* followed by names of group, grid, and test case.
72b7576f 142
146 Draw[1]> test blend simple A1
147 CASE blend simple A1: OK
148 Draw[2]>
504a8968 151Note that normally an intermediate output of the script is not shown. The detailed log of the test can be obtained after the test execution by running command <i>"dlog get"</i>.
153To see intermediate commands and their output during the test execution, add one more argument
154<i>"echo"</i> at the end of the command line. Note that with this option the log is not collected and summary is not produced.
ae3eaf7b 156Type <i>help test</i> in DRAW prompt to get help on options supported by *test* command:
936f43da 157
159Draw[3]> help test
160test: Run specified test case
161 Use: test group grid casename [options...]
162 Allowed options are:
163 -echo: all commands and results are echoed immediately,
164 but log is not saved and summary is not produced
165 It is also possible to use "1" instead of "-echo"
166 If echo is OFF, log is stored in memory and only summary
167 is output (the log can be obtained with command "dlog get")
168 -outfile filename: set log file (should be non-existing),
169 it is possible to save log file in text file or
170 in html file(with snapshot), for that "filename"
171 should have ".html" extension
172 -overwrite: force writing log in existing file
173 -beep: play sound signal at the end of the test
174 -errors: show all lines from the log report that are recognized as errors
175 This key will be ignored if the "-echo" key is already set.
dcc0a33e 178@subsubsection testmanual_intro_quick_create Creating a New Test
504a8968 179
67d7f07f 180The detailed rules of creation of new tests are given in @ref testmanual_3 "Creation and modification of tests" chapter. The following short description covers the most typical situations:
504a8968 181
6d368502 182Use prefix <i>bug</i> followed by Mantis issue ID and, if necessary, additional suffixes, for naming the test script, data files, and DRAW commands specific for this test case.
504a8968 183
6d368502 1841. If the test requires C++ code, add it as new DRAW command(s) in one of files in *QABugs* package.
67d7f07f 1852. Add script(s) for the test case in the subfolder corresponding to the relevant OCCT module of the group *bugs* <i>($CASROOT/tests/bugs)</i>. See @ref testmanual_5_2 "the correspondence map".
504a8968 1863. In the test script:
187 * Load all necessary DRAW modules by command *pload*.
188 * Use command *locate_data_file* to get a path to data files used by test script. (Make sure to have this command not inside catch statement if it is used.)
189 * Use DRAW commands to reproduce the situation being tested.
6d368502 190 * Make sure that in case of failure the test produces message containing word "Error" or other recognized by test system as error (add new error patterns in file parse.rules if necessary).
191 * If test case reports error due to existing problem and the fix is not available, add @ref testmanual_3_6 "TODO" statement for each error to mark it as known problem. The TODO statements must be specific so as to match the actually generated messages but not all similar errors.
192 * To check expected output which should be obtained as a result of a test, add @ref testmanual_3_7 "REQUIRED" statement for each line of output to mark it as required.
193 * If test case produces error messages (contained in parse.rules) which are expected in that test and should not be considered as its failure (e.g. test for checkshape command), add REQUIRED statement for each error to mark it as required output.
1944. If the test uses data file(s) not yet present in the test database, these can be put to (sub)directory pointed out by *CSF_TestDataPath* variable for running test. The files should be attached to Mantis issue corresponding to the modification being tested.
504a8968 1955. Check that the test case runs as expected (test for fix: OK with the fix, FAILED without the fix; test for existing problem: BAD), and integrate to Git branch created for the issue.
199* Added files:
936f43da 200
504a8968 201~~~~~
202git status –short
6d368502 203A tests/bugs/heal/data/bug210_a.brep
204A tests/bugs/heal/data/bug210_b.brep
504a8968 205A tests/bugs/heal/bug210_1
206A tests/bugs/heal/bug210_2
209* Test script
6d368502 211~~~~~{.tcl}
504a8968 212puts "OCC210 (case 1): Improve FixShape for touching wires"
6d368502 214restore [locate_data_file bug210_a.brep] a
504a8968 215
216fixshape result a 0.01 0.01
217checkshape result
72b7576f 219
220@section testmanual_2 Organization of Test Scripts
222@subsection testmanual_2_1 General Layout
224Standard OCCT tests are located in subdirectory tests of the OCCT root folder ($CASROOT).
72b7576f 225
504a8968 226Additional test folders can be added to the test system by defining environment variable *CSF_TestScriptsPath*. This should be list of paths separated by semicolons (*;*) on Windows
6d368502 227or colons (*:*) on Linux or Mac. Upon DRAW launch, path to *tests* subfolder of OCCT is added at the end of this variable automatically.
504a8968 228
229Each test folder is expected to contain:
6d368502 230 * Optional file *parse.rules* defining patterns for interpretation of test results, common for all groups in this folder
72b7576f 231 * One or several test group directories.
233Each group directory contains:
504a8968 235 * File *grids.list* that identifies this test group and defines list of test grids in it.
236 * Test grids (sub-directories), each containing set of scripts for test cases, and optional files *cases.list*, *parse.rules*, *begin* and *end*.
72b7576f 237 * Optional sub-directory data
72b7576f 238
504a8968 239By convention, names of test groups, grids, and cases should contain no spaces and be lower-case.
240The names *begin, end, data, parse.rules, grids.list* and *cases.list* are reserved.
72b7576f 241
504a8968 242General layout of test scripts is shown in Figure 1.
244@image html /dev_guides/tests/images/tests_image001.png "Layout of tests folder"
245@image latex /dev_guides/tests/images/tests_image001.png "Layout of tests folder"
72b7576f 246
72b7576f 247
248@subsection testmanual_2_2 Test Groups
250@subsubsection testmanual_2_2_1 Group Names
504a8968 252The names of directories of test groups containing systematic test grids correspond to the functionality tested by each group.
72b7576f 254Example:
504a8968 256~~~~~
72b7576f 257 caf
258 mesh
259 offset
504a8968 260~~~~~
72b7576f 261
504a8968 262Test group *bugs* is used to collect the tests coming from bug reports. Group *demo* collects tests of the test system, DRAW, samples, etc.
72b7576f 263
504a8968 264@subsubsection testmanual_2_2_2 File "grids.list"
266This test group contains file *grids.list*, which defines an ordered list of grids in this group in the following format:
72b7576f 267
269001 gridname1
270002 gridname2
272NNN gridnameN
278 001 basic
279 002 advanced
504a8968 282@subsubsection testmanual_2_2_3 File "begin"
72b7576f 283
504a8968 284This file is a Tcl script. It is executed before every test in the current group.
72b7576f 285Usually it loads necessary Draw commands, sets common parameters and defines
286additional Tcl functions used in test scripts.
504a8968 287
72b7576f 288Example:
291 pload TOPTEST ;# load topological command
292 set cpulimit 300 ;# set maximum time allowed for script execution
504a8968 295@subsubsection testmanual_2_2_4 File "end"
72b7576f 296
504a8968 297This file is a TCL script. It is executed after every test in the current group. Usually it checks the results of script work, makes a snap-shot of the viewer and writes *TEST COMPLETED* to the output.
72b7576f 298
504a8968 299Note: *TEST COMPLETED* string should be present in the output to indicate that the test is finished without crash.
67d7f07f 301See @ref testmanual_3 "Creation and modification of tests" chapter for more information.
504a8968 302
72b7576f 305 if { [isdraw result] } {
306 checkshape result
307 } else {
4ee1bdf4 308 puts "Error: The result shape can not be built"
72b7576f 309 }
4ee1bdf4 310 puts "TEST COMPLETED"
504a8968 311~~~~~
313@subsubsection testmanual_2_2_5 File "parse.rules"
315The test group may contain *parse.rules* file. This file defines patterns used for analysis of the test execution log and deciding the status of the test run.
317Each line in the file should specify a status (single word), followed by a regular expression delimited by slashes (*/*) that will be matched against lines in the test output log to check if it corresponds to this status.
6d368502 319The regular expressions should follow <a href="http://www.tcl.tk/man/tcl/TclCmd/re_syntax.htm">Tcl syntax</a>, with special exception that "\b" is considered as word limit (Perl-style), in addition to "\y" used in Tcl.
504a8968 320
321The rest of the line can contain a comment message, which will be added to the test report when this status is detected.
72b7576f 322
72b7576f 323Example:
504a8968 325~~~~~
6d368502 326 FAILED /\b[Ee]xception\b/ exception
327 FAILED /\bError\b/ error
72b7576f 328 SKIPPED /Cannot open file for reading/ data file is missing
329 SKIPPED /Could not read file .*, abandon/ data file is missing
504a8968 330~~~~~
72b7576f 331
332Lines starting with a *#* character and blank lines are ignored to allow comments and spacing.
72b7576f 333
dcc0a33e 334See @ref testmanual_details_results "Interpretation of test results" chapter for details.
504a8968 335
336If a line matches several rules, the first one applies. Rules defined in the grid are checked first, then rules in the group, then rules in the test root directory. This allows defining some rules on the grid level with status *IGNORE* to ignore messages that would otherwise be treated as errors due to the group level rules.
72b7576f 338Example:
e5bd0d98 341 FAILED /\\bFaulty\\b/ bad shape
72b7576f 342 IGNORE /^Error [23]d = [\d.-]+/ debug output of blend command
343 IGNORE /^Tcl Exception: tolerance ang : [\d.-]+/ blend failure
504a8968 346@subsubsection testmanual_2_2_6 Directory "data"
67d7f07f 347The test group may contain subdirectory *data*, where test scripts shared by different test grids can be put. See also @ref testmanual_2_3_5 "Directory data".
504a8968 348
72b7576f 349@subsection testmanual_2_3 Test Grids
351@subsubsection testmanual_2_3_1 Grid Names
504a8968 353The folder of a test group can have several sub-directories (Grid 1… Grid N) defining test grids.
354Each directory contains a set of related test cases. The name of a directory should correspond to its contents.
72b7576f 355
504a8968 358~~~~~
72b7576f 359caf
360 basic
361 bugs
362 presentation
504a8968 363~~~~~
72b7576f 364
504a8968 365Here *caf* is the name of the test group and *basic*, *bugs*, *presentation*, etc. are the names of grids.
72b7576f 366
504a8968 367@subsubsection testmanual_2_3_2 File "begin"
369This file is a TCL script executed before every test in the current grid.
72b7576f 370
72b7576f 371Usually it sets variables specific for the current grid.
504a8968 372
72b7576f 373Example:
376 set command bopfuse ;# command tested in this grid
504a8968 379@subsubsection testmanual_2_3_3 File "end"
381This file is a TCL script executed after every test in current grid.
383Usually it executes a specific sequence of commands common for all tests in the grid.
72b7576f 384
72b7576f 385Example:
936f43da 388 vdump $imagedir/${casename}.png ;# makes a snap-shot of AIS viewer
72b7576f 389~~~~~~~~~~~~~~~~~~~~~~~~~~~~~~~~~~~~~~~~~~~~~~~~~~~~~~~~~~~~~~~~~~~~~
504a8968 391@subsubsection testmanual_2_3_4 File "cases.list"
72b7576f 392
393The grid directory can contain an optional file cases.list
504a8968 394defining an alternative location of the test cases.
395This file should contain a single line defining the relative path to the collection of test cases.
72b7576f 396
504a8968 399~~~~~
72b7576f 400../data/simple
504a8968 401~~~~~
403This option is used for creation of several grids of tests with the same data files and operations but performed with differing parameters. The common scripts are usually located place in the common
404subdirectory of the test group, <i>data/simple</i> for example.
72b7576f 405
504a8968 406If file *cases.list* exists, the grid directory should not contain any test cases.
72b7576f 407The specific parameters and pre- and post-processing commands
504a8968 408for test execution in this grid should be defined in the files *begin* and *end*.
411@subsubsection testmanual_2_3_5 Directory "data"
413The test grid may contain subdirectory *data*, containing data files used in tests (BREP, IGES, STEP, etc.) of this grid.
72b7576f 414
415@subsection testmanual_2_4 Test Cases
504a8968 417The test case is a TCL script, which performs some operations using DRAW commands
418and produces meaningful messages that can be used to check the validity of the result.
72b7576f 420Example:
423 pcylinder c1 10 20 ;# create first cylinder
424 pcylinder c2 5 20 ;# create second cylinder
425 ttranslate c2 5 0 10 ;# translate second cylinder to x,y,z
426 bsection result c1 c2 ;# create a section of two cylinders
427 checksection result ;# will output error message if result is bad
504a8968 430The test case can have any name (except for the reserved names *begin, end, data, cases.list* and *parse.rules*).
72b7576f 431For systematic grids it is usually a capital English letter followed by a number.
504a8968 435~~~~~
72b7576f 436 A1
437 A2
438 B1
439 B2
504a8968 440~~~~~
72b7576f 441
504a8968 442Such naming facilitates compact representation of tests execution results in tabular format within HTML reports.
72b7576f 443
72b7576f 444
445@section testmanual_3 Creation And Modification Of Tests
447This section describes how to add new tests and update existing ones.
449@subsection testmanual_3_1 Choosing Group, Grid, and Test Case Name
504a8968 451The new tests are usually added in the frame of processing issues in OCCT Mantis tracker.
72b7576f 452Such tests in general should be added to group bugs, in the grid
67d7f07f 453corresponding to the affected OCCT functionality. See @ref testmanual_5_2 "Mapping of OCCT functionality to grid names in group bugs".
504a8968 454
455New grids can be added as necessary to contain tests for the functionality not yet covered by existing test grids.
456The test case name in the bugs group should be prefixed by the ID of the corresponding issue in Mantis (without leading zeroes) with prefix *bug*. It is recommended to add a suffix providing a hint on the tested situation. If more than one test is added for a bug, they should be distinguished by suffixes; either meaningful or just ordinal numbers.
72b7576f 457
504a8968 461 bug12345_coaxial
462 bug12345_orthogonal_1
463 bug12345_orthogonal_2
72b7576f 464~~~~~~~~~~~~~~~~~~~~~~~~~~~~~~~~~~~~~~~~~~~~~~~~~~~~~~~~~~~~~~~~~~~~~
504a8968 466If the new test corresponds to a functionality already covered by the existing systematic test grid (e.g. group *mesh* for *BRepMesh* issues), this test can be added (or moved later by OCC team) to that grid.
72b7576f 467
468@subsection testmanual_3_2 Adding Data Files Required for a Test
ae3eaf7b 470It is advisable to make self-contained test scripts whenever possible, so as they could be used in the environments where data files are not available. For that simple geometric objects and shapes can be created using DRAW commands in the test script itself.
504a8968 471
ae3eaf7b 472If the test requires a data file, it should be put to the directory listed in environment variable *CSF_TestDataPath*.
936f43da 473Alternatively, it can be put to subdirectory *data* of the test grid.
474It is recommended to prefix the data file with the corresponding issue id prefixed by *bug*, e.g. *bug12345_face1.brep*, to avoid possible conflicts with names of existing data files.
504a8968 475
ae3eaf7b 476Note that when the test is integrated to the master branch, OCC team will move the data file to the data files repository, to keep OCCT sources repository clean from data files.
504a8968 477
ae3eaf7b 478When you prepare a test script, try to minimize the size of involved data model. For instance, if the problem detected on a big shape can be reproduced on a single face extracted from that shape, use only that face in the test.
504a8968 479
481@subsection testmanual_3_3 Adding new DRAW commands
483If the test cannot be implemented using available DRAW commands, consider the following possibilities:
484* If the existing DRAW command can be extended to enable possibility required for a test in a natural way (e.g. by adding an option to activate a specific mode of the algorithm), this way is recommended. This change should be appropriately documented in a relevant Mantis issue.
485* If the new command is needed to access OCCT functionality not exposed to DRAW previously, and this command can be potentially reused (for other tests), it should be added to the package where similar commands are implemented (use *getsource* DRAW command to get the package name). The name and arguments of the new command should be chosen to keep similarity with the existing commands. This change should be documented in a relevant Mantis issue.
486* Otherwise the new command implementing the actions needed for this particular test should be added in *QABugs* package. The command name should be formed by the Mantis issue ID prefixed by *bug*, e.g. *bug12345*.
488Note that a DRAW command is expected to return 0 in case of a normal completion, and 1 (Tcl exception) if it is incorrectly used (e.g. a wrong number of input arguments). Thus if the new command needs to report a test error, this should be done by outputting an appropriate error message rather than by returning a non-zero value.
ae3eaf7b 489File names must be encoded in the script rather than in the DRAW command and passed to the DRAW command as an argument.
504a8968 490
491@subsection testmanual_3_4 Script Implementation
493The test should run commands necessary to perform the tested operations, in general assuming a clean DRAW session. The required DRAW modules should be loaded by *pload* command, if it is not done by *begin* script. The messages produced by commands in a standard output should include identifiable messages on the discovered problems if any.
495Usually the script represents a set of commands that a person would run interactively to perform the operation and see its results, with additional comments to explain what happens.
72b7576f 497Example:
504a8968 498~~~~~
499# Simple test of fusing box and sphere
500box b 10 10 10
501sphere s 5
502bfuse result b s
503checkshape result
72b7576f 505
504a8968 506Make sure that file *parse.rules* in the grid or group directory contains a regular expression to catch possible messages indicating the failure of the test.
508For instance, for catching errors reported by *checkshape* command relevant grids define a rule to recognize its report by the word *Faulty*:
511FAILED /\bFaulty\b/ bad shape
514For the messages generated in the script it is recommended to use the word 'Error' in the error message.
72b7576f 515
72b7576f 516Example:
504a8968 518~~~~~
519set expected_length 11
520if { [expr $actual_length - $expected_length] > 0.001 } {
521 puts "Error: The length of the edge should be $expected_length"
525At the end, the test script should output *TEST COMPLETED* string to mark a successful completion of the script. This is often done by the *end* script in the grid.
527When the test script requires a data file, use Tcl procedure *locate_data_file* to get a path to it, instead of putting the path explicitly. This will allow easy move of the data file from OCCT sources repository to the data files repository without the need to update the test script.
72b7576f 528
72b7576f 529Example:
504a8968 531~~~~~
532stepread [locate_data_file CAROSKI_COUPELLE.step] a *
936f43da 535When the test needs to produce some snapshots or other artefacts, use Tcl variable *imagedir* as the location where such files should be put.
ae3eaf7b 536* Command *testgrid* sets this variable to the subdirectory of the results folder corresponding to the grid.
537* Command *test* by default creates a dedicated temporary directory in the system temporary folder (normally the one specified by environment variable *TempDir*, *TEMP*, or *TMP*) for each execution, and sets *imagedir* to that location.
539However if variable *imagedir* is defined on the top level of Tcl interpretor, command *test* will use it instead of creating a new directory.
936f43da 540
541Use Tcl variable *casename* to prefix all files produced by the test.
542This variable is set to the name of the test case.
ae3eaf7b 543
544The test system can recognize an image file (snapshot) and include it in HTML log and differences if its name starts with the name of the test case (use variable *casename*), optionally followed by underscore or dash and arbitrary suffix.
936f43da 546The image format (defined by extension) should be *png*.
72b7576f 547
72b7576f 548Example:
504a8968 549~~~~~
936f43da 550xwd $imagedir/${casename}.png
504a8968 551vdisplay result; vfit
936f43da 552vdump $imagedir/${casename}-axo.png
504a8968 553vfront; vfit
936f43da 554vdump $imagedir/${casename}-front.png
504a8968 555~~~~~
72b7576f 556
504a8968 557would produce:
72b7576f 563
504a8968 564Note that OCCT must be built with FreeImage support to be able to produce usable images.
72b7576f 565
936f43da 566Other Tcl variables defined during the test execution are:
ae3eaf7b 567- *groupname*: name of the test group;
568- *gridname*: name of the test grid;
569- *dirname*: path to the root directory of the current set of test scripts.
936f43da 570
504a8968 571In order to ensure that the test works as expected in different environments, observe the following additional rules:
572* Avoid using external commands such as *grep, rm,* etc., as these commands can be absent on another system (e.g. on Windows); use facilities provided by Tcl instead.
573* Do not put call to *locate_data_file* in catch statement – this can prevent correct interpretation of the missing data file by the test system.
6d368502 574* Do not use commands *decho* and *dlog* in the test script, to avoid interference with use of these commands by the test system.
72b7576f 575
dcc0a33e 576@subsection testmanual_details_results Interpretation of test results
72b7576f 577
504a8968 578The result of the test is evaluated by checking its output against patterns defined in the files *parse.rules* of the grid and group.
72b7576f 579
504a8968 580The OCCT test system recognizes five statuses of the test execution:
581* SKIPPED: reported if a line matching SKIPPED pattern is found (prior to any FAILED pattern). This indicates that the test cannot be run in the current environment; the most typical case is the absence of the required data file.
6d368502 582* FAILED: reported if a line matching pattern with status FAILED is found (unless it is masked by the preceding IGNORE pattern or a TODO or REQUIRED statement), or if message TEST COMPLETED or at least one of REQUIRED patterns is not found. This indicates that the test has produced a bad or unexpected result, and usually means a regression.
583* BAD: reported if the test script output contains one or several TODO statements and the corresponding number of matching lines in the log. This indicates a known problem. The lines matching TODO statements are not checked against other patterns and thus will not cause a FAILED status.
504a8968 584* IMPROVEMENT: reported if the test script output contains a TODO statement for which no corresponding line is found. This is a possible indication of improvement (a known problem has disappeared).
585* OK: reported if none of the above statuses have been assigned. This means that the test has passed without problems.
72b7576f 586
504a8968 587Other statuses can be specified in *parse.rules* files, these will be classified as FAILED.
72b7576f 588
504a8968 589For integration of the change to OCCT repository, all tests should return either OK or BAD status.
590The new test created for an unsolved problem should return BAD. The new test created for a fixed problem should return FAILED without the fix, and OK with the fix.
72b7576f 591
504a8968 592@subsection testmanual_3_6 Marking BAD cases
72b7576f 593
ae3eaf7b 594If the test produces an invalid result at a certain moment then the corresponding bug should be created in the OCCT issue tracker located at http://tracker.dev.opencascade.org, and the problem should be marked as TODO in the test script.
72b7576f 595
504a8968 596The following statement should be added to such a test script:
598puts "TODO BugNumber ListOfPlatforms: RegularExpression"
602* *BugNumber* is the bug ID in the tracker. For example: #12345.
6d368502 603* *ListOfPlatforms* is a list of platforms, at which the bug is reproduced (Linux, Windows, MacOS, or All). Note that the platform name is custom for the OCCT test system; it corresponds to the value of environment variable *os_type* defined in DRAW.
72b7576f 604
504a8968 606~~~~~
607Draw[2]> puts $env(os_type)
72b7576f 610
ae3eaf7b 611* RegularExpression is a regular expression, which should be matched against the line indicating the problem in the script output.
72b7576f 612
72b7576f 613Example:
504a8968 614~~~~~
615puts "TODO #22622 Mandriva2008: Abort .* an exception was raised"
72b7576f 617
504a8968 618The parser checks the test output and if an output line matches the *RegularExpression* then it will be assigned a BAD status instead of FAILED.
72b7576f 619
504a8968 620A separate TODO line must be added for each output line matching an error expression to mark the test as BAD. If not all TODO messages are found in the test log, the test will be considered as possible improvement.
622To mark the test as BAD for an incomplete case (when the final *TEST COMPLETE* message is missing) the expression *TEST INCOMPLETE* should be used instead of the regular expression.
72b7576f 623
504a8968 626~~~~~
627puts "TODO OCC22817 All: exception.+There are no suitable edges"
628puts "TODO OCC22817 All: \\*\\* Exception \\*\\*"
629puts "TODO OCC22817 All: TEST INCOMPLETE"
72b7576f 631
6d368502 632@subsection testmanual_3_7 Marking required output
634To check expected output which must be obtained as a result of a test for it to be considered correct, add REQUIRED statement for each specific message.
635For that, the following statement should be added to such a test script:
638puts "REQUIRED ListOfPlatforms: RegularExpression"
641Here *ListOfPlatforms* and *RegularExpression* have the same meaning as in TODO statements described above.
b502ddc1 643The REQUIRED statement can also be used to mask message that would normally be interpreted as error (according to rules defined in *parse.rules*) but should not be considered as such within current test.
6d368502 644
b502ddc1 647puts "REQUIRED Linux: Faulty shapes in variables faulty_1 to faulty_5"
6d368502 648~~~~~
650This statement notifies test system that errors reported by *checkshape* command are expected in that test case, and test should be considered as OK if this message appears, despite of presence of general rule stating that 'Faulty' signals failure.
504a8968 651
6d368502 652If output does not contain required statement, test case will be marked as FAILED.
504a8968 653
654@section testmanual_4 Advanced Use
72b7576f 655
656@subsection testmanual_4_1 Running Tests on Older Versions of OCCT
ae3eaf7b 658Sometimes it might be necessary to run tests on the previous versions of OCCT (<= 6.5.4) that do not include this test system. This can be done by adding DRAW configuration file *DrawAppliInit* in the directory, which is current by the moment of DRAW start-up, to load test commands and to define the necessary environment.
72b7576f 659
504a8968 660Note: in OCCT 6.5.3, file *DrawAppliInit* already exists in <i>$CASROOT/src/DrawResources</i>, new commands should be added to this file instead of a new one in the current directory.
662For example, let us assume that *d:/occt* contains an up-to-date version of OCCT sources with tests, and the test data archive is unpacked to *d:/test-data*):
665set env(CASROOT) d:/occt
666set env(CSF_TestScriptsPath) $env(CASROOT)/tests
667source $env(CASROOT)/src/DrawResources/TestCommands.tcl
668set env(CSF_TestDataPath) $env(CASROOT)/data;d:/test-data
ae3eaf7b 672Note that on older versions of OCCT the tests are run in compatibility mode and thus not all output of the test command can be captured; this can lead to absence of some error messages (can be reported as either a failure or an improvement).
504a8968 673
674@subsection testmanual_4_2 Adding custom tests
676You can extend the test system by adding your own tests. For that it is necessary to add paths to the directory where these tests are located, and one or more additional data directories, to the environment variables *CSF_TestScriptsPath* and *CSF_TestDataPath*. The recommended way for doing this is using DRAW configuration file *DrawAppliInit* located in the directory which is current by the moment of DRAW start-up.
4ee1bdf4 678Use Tcl command <i>_path_separator</i> to insert a platform-dependent separator to the path list.
504a8968 679
680For example:
682set env(CSF_TestScriptsPath) \
683 $env(TestScriptsPath)[_path_separator]d:/MyOCCTProject/tests
684set env(CSF_TestDataPath) \
685 d:/occt/test-data[_path_separator]d:/MyOCCTProject/data
686return ;# this is to avoid an echo of the last command above in cout
689@subsection testmanual_4_3 Parallel execution of tests
691For better efficiency, on computers with multiple CPUs the tests can be run in parallel mode. This is default behavior for command *testgrid* : the tests are executed in parallel processes (their number is equal to the number of CPUs available on the system). In order to change this behavior, use option parallel followed by the number of processes to be used (1 or 0 to run sequentially).
72b7576f 692
87f42a3f 693Note that the parallel execution is only possible if Tcl extension package *Thread* is installed.
694If this package is not available, *testgrid* command will output a warning message.
72b7576f 695
504a8968 696@subsection testmanual_4_4 Checking non-regression of performance, memory, and visualization
72b7576f 697
504a8968 698Some test results are very dependent on the characteristics of the workstation, where they are performed, and thus cannot be checked by comparison with some predefined values. These results can be checked for non-regression (after a change in OCCT code) by comparing them with the results produced by the version without this change. The most typical case is comparing the result obtained in a branch created for integration of a fix (CR***) with the results obtained on the master branch before that change is made.
700OCCT test system provides a dedicated command *testdiff* for comparing CPU time of execution, memory usage, and images produced by the tests.
703testdiff dir1 dir2 [groupname [gridname]] [options...]
705Here *dir1* and *dir2* are directories containing logs of two test runs.
707Possible options are:
ba06f8bb 708* <i>-save \<filename\> </i> - saves the resulting log in a specified file (<i>$dir1/diff-$dir2.log</i> by default). HTML log is saved with the same name and extension .html;
504a8968 709* <i>-status {same|ok|all}</i> - allows filtering compared cases by their status:
710 * *same* - only cases with same status are compared (default);
711 * *ok* - only cases with OK status in both logs are compared;
712 * *all* - results are compared regardless of status;
ba06f8bb 713* <i>-verbose \<level\> </i> - defines the scope of output data:
504a8968 714 * 1 - outputs only differences;
715 * 2 - additionally outputs the list of logs and directories present in one of directories only;
716 * 3 - (by default) additionally outputs progress messages;
72b7576f 717
72b7576f 718Example:
504a8968 719
721Draw[]> testdiff results-CR12345-2012-10-10T08:00 results-master-2012-10-09T21:20
724@section testmanual_5 APPENDIX
726@subsection testmanual_5_1 Test groups
728@subsubsection testmanual_5_1_1 3rdparty
730This group allows testing the interaction of OCCT and 3rdparty products.
734| Grid | Commands | Functionality |
735| :---- | :----- | :------- |
736| export | vexport | export of images to different formats |
737| fonts | vtrihedron, vcolorscale, vdrawtext | display of fonts |
740@subsubsection testmanual_5_1_2 blend
742This group allows testing blends (fillets) and related operations.
744DRAW module: MODELING.
746| Grid | Commands | Functionality |
747| :---- | :----- | :------- |
748| simple | blend | fillets on simple shapes |
749| complex | blend | fillets on complex shapes, non-trivial geometry |
750| tolblend_simple | tolblend, blend | |
751| buildevol | buildevol | |
752| tolblend_buildvol | tolblend, buildevol | use of additional command tolblend |
753| bfuseblend | bfuseblend | |
754| encoderegularity | encoderegularity | |
756@subsubsection testmanual_5_1_3 boolean
758This group allows testing Boolean operations.
760DRAW module: MODELING (packages *BOPTest* and *BRepTest*).
762Grids names are based on name of the command used, with suffixes:
763* <i>_2d</i> – for tests operating with 2d objects (wires, wires, 3d objects, etc.);
764* <i>_simple</i> – for tests operating on simple shapes (boxes, cylinders, toruses, etc.);
765* <i>_complex</i> – for tests dealing with complex shapes.
767| Grid | Commands | Functionality |
768| :---- | :----- | :------- |
769| bcommon_2d | bcommon | Common operation (old algorithm), 2d |
770| bcommon_complex | bcommon | Common operation (old algorithm), complex shapes |
771| bcommon_simple | bcommon | Common operation (old algorithm), simple shapes |
772| bcut_2d | bcut | Cut operation (old algorithm), 2d |
773| bcut_complex | bcut | Cut operation (old algorithm), complex shapes |
774| bcut_simple | bcut | Cut operation (old algorithm), simple shapes |
775| bcutblend | bcutblend | |
776| bfuse_2d | bfuse | Fuse operation (old algorithm), 2d |
777| bfuse_complex | bfuse | Fuse operation (old algorithm), complex shapes |
778| bfuse_simple | bfuse | Fuse operation (old algorithm), simple shapes |
779| bopcommon_2d | bopcommon | Common operation, 2d |
780| bopcommon_complex | bopcommon | Common operation, complex shapes |
781| bopcommon_simple | bopcommon | Common operation, simple shapes |
782| bopcut_2d | bopcut | Cut operation, 2d |
783| bopcut_complex | bopcut | Cut operation, complex shapes |
784| bopcut_simple | bopcut | Cut operation, simple shapes |
785| bopfuse_2d | bopfuse | Fuse operation, 2d |
786| bopfuse_complex | bopfuse | Fuse operation, complex shapes |
787| bopfuse_simple | bopfuse | Fuse operation, simple shapes |
788| bopsection | bopsection | Section |
789| boptuc_2d | boptuc | |
790| boptuc_complex | boptuc | |
791| boptuc_simple | boptuc | |
792| bsection | bsection | Section (old algorithm) |
794@subsubsection testmanual_5_1_4 bugs
796This group allows testing cases coming from Mantis issues.
798The grids are organized following OCCT module and category set for the issue in the Mantis tracker.
67d7f07f 799See @ref testmanual_5_2 "Mapping of OCCT functionality to grid names in group bugs" chapter for details.
504a8968 800
801@subsubsection testmanual_5_1_5 caf
803This group allows testing OCAF functionality.
807| Grid | Commands | Functionality |
808| :---- | :----- | :------- |
809| basic | | Basic attributes |
810| bugs | | Saving and restoring of document |
811| driver | | OCAF drivers |
812| named_shape | | *TNaming_NamedShape* attribute |
813| presentation | | *AISPresentation* attributes |
814| tree | | Tree construction attributes |
815| xlink | | XLink attributes |
817@subsubsection testmanual_5_1_6 chamfer
819This group allows testing chamfer operations.
821DRAW module: MODELING.
823The test grid name is constructed depending on the type of the tested chamfers. Additional suffix <i>_complex</i> is used for test cases involving complex geometry (e.g. intersections of edges forming a chamfer); suffix <i>_sequence</i> is used for grids where chamfers are computed sequentially.
825| Grid | Commands | Functionality |
826| :---- | :----- | :------- |
827| equal_dist | | Equal distances from edge |
828| equal_dist_complex | | Equal distances from edge, complex shapes |
829| equal_dist_sequence | | Equal distances from edge, sequential operations |
830| dist_dist | | Two distances from edge |
831| dist_dist_complex | | Two distances from edge, complex shapes |
832| dist_dist_sequence | | Two distances from edge, sequential operations |
833| dist_angle | | Distance from edge and given angle |
834| dist_angle_complex | | Distance from edge and given angle |
835| dist_angle_sequence | | Distance from edge and given angle |
837@subsubsection testmanual_5_1_7 demo
839This group allows demonstrating how testing cases are created, and testing DRAW commands and the test system as a whole.
841| Grid | Commands | Functionality |
842| :---- | :----- | :------- |
843| draw | getsource, restore | Basic DRAW commands |
844| testsystem | | Testing system |
845| samples | | OCCT samples |
848@subsubsection testmanual_5_1_8 draft
850This group allows testing draft operations.
852DRAW module: MODELING.
854| Grid | Commands | Functionality |
855| :---- | :----- | :------- |
856| Angle | depouille | Drafts with angle (inclined walls) |
859@subsubsection testmanual_5_1_9 feat
861This group allows testing creation of features on a shape.
863DRAW module: MODELING (package *BRepTest*).
865| Grid | Commands | Functionality |
866| :---- | :----- | :------- |
867| featdprism | | |
868| featlf | | |
869| featprism | | |
870| featrevol | | |
871| featrf | | |
873@subsubsection testmanual_5_1_10 heal
875This group allows testing the functionality provided by *ShapeHealing* toolkit.
877DRAW module: XSDRAW
879| Grid | Commands | Functionality |
880| :---- | :----- | :------- |
881| fix_shape | fixshape | Shape healing |
882| fix_gaps | fixwgaps | Fixing gaps between edges on a wire |
883| same_parameter | sameparameter | Fixing non-sameparameter edges |
884| fix_face_size | DT_ApplySeq | Removal of small faces |
885| elementary_to_revolution | DT_ApplySeq | Conversion of elementary surfaces to revolution |
886| direct_faces | directfaces | Correction of axis of elementary surfaces |
887| drop_small_edges | fixsmall | Removal of small edges |
888| split_angle | DT_SplitAngle | Splitting periodic surfaces by angle |
889| split_angle_advanced | DT_SplitAngle | Splitting periodic surfaces by angle |
890| split_angle_standard | DT_SplitAngle | Splitting periodic surfaces by angle |
891| split_closed_faces | DT_ClosedSplit | Splitting of closed faces |
892| surface_to_bspline | DT_ToBspl | Conversion of surfaces to b-splines |
893| surface_to_bezier | DT_ShapeConvert | Conversion of surfaces to bezier |
894| split_continuity | DT_ShapeDivide | Split surfaces by continuity criterion |
895| split_continuity_advanced | DT_ShapeDivide | Split surfaces by continuity criterion |
896| split_continuity_standard | DT_ShapeDivide | Split surfaces by continuity criterion |
897| surface_to_revolution_advanced | DT_ShapeConvertRev | Convert elementary surfaces to revolutions, complex cases |
898| surface_to_revolution_standard | DT_ShapeConvertRev | Convert elementary surfaces to revolutions, simple cases |
900@subsubsection testmanual_5_1_11 mesh
4ee1bdf4 902This group allows testing shape tessellation (*BRepMesh*) and shading.
504a8968 903
904DRAW modules: MODELING (package *MeshTest*), VISUALIZATION (package *ViewerTest*)
906| Grid | Commands | Functionality |
907| :---- | :----- | :------- |
908| advanced_shading | vdisplay | Shading, complex shapes |
909| standard_shading | vdisplay | Shading, simple shapes |
910| advanced_mesh | mesh | Meshing of complex shapes |
911| standard_mesh | mesh | Meshing of simple shapes |
912| advanced_incmesh | incmesh | Meshing of complex shapes |
913| standard_incmesh | incmesh | Meshing of simple shapes |
914| advanced_incmesh_parallel | incmesh | Meshing of complex shapes, parallel mode |
915| standard_incmesh_parallel | incmesh | Meshing of simple shapes, parallel mode |
917@subsubsection testmanual_5_1_12 mkface
919This group allows testing creation of simple surfaces.
921DRAW module: MODELING (package *BRepTest*)
923| Grid | Commands | Functionality |
924| :---- | :----- | :------- |
925| after_trim | mkface | |
926| after_offset | mkface | |
927| after_extsurf_and_offset | mkface | |
928| after_extsurf_and_trim | mkface | |
929| after_revsurf_and_offset | mkface | |
930| mkplane | mkplane | |
932@subsubsection testmanual_5_1_13 nproject
934This group allows testing normal projection of edges and wires onto a face.
936DRAW module: MODELING (package *BRepTest*)
938| Grid | Commands | Functionality |
939| :---- | :----- | :------- |
940| Base | nproject | |
942@subsubsection testmanual_5_1_14 offset
944This group allows testing offset functionality for curves and surfaces.
946DRAW module: MODELING (package *BRepTest*)
948| Grid | Commands | Functionality |
949| :---- | :----- | :------- |
950| compshape | offsetcompshape | Offset of shapes with removal of some faces |
951| faces_type_a | offsetparameter, offsetload, offsetperform | Offset on a subset of faces with a fillet |
952| faces_type_i | offsetparameter, offsetload, offsetperform | Offset on a subset of faces with a sharp edge |
953| shape_type_a | offsetparameter, offsetload, offsetperform | Offset on a whole shape with a fillet |
954| shape_type_i | offsetparameter, offsetload, offsetperform | Offset on a whole shape with a fillet |
955| shape | offsetshape | |
956| wire_closed_outside_0_005, wire_closed_outside_0_025, wire_closed_outside_0_075, wire_closed_inside_0_005, wire_closed_inside_0_025, wire_closed_inside_0_075, wire_unclosed_outside_0_005, wire_unclosed_outside_0_025, wire_unclosed_outside_0_075 | mkoffset | 2d offset of closed and unclosed planar wires with different offset step and directions of offset ( inside / outside ) |
958@subsubsection testmanual_5_1_15 pipe
960This group allows testing construction of pipes (sweeping of a contour along profile).
962DRAW module: MODELING (package *BRepTest*)
964| Grid | Commands | Functionality |
965| :---- | :----- | :------- |
966| Standard | pipe | |
968@subsubsection testmanual_5_1_16 prism
970This group allows testing construction of prisms.
972DRAW module: MODELING (package *BRepTest*)
974| Grid | Commands | Functionality |
975| :---- | :----- | :------- |
976| seminf | prism | |
978@subsubsection testmanual_5_1_17 sewing
980This group allows testing sewing of faces by connecting edges.
982DRAW module: MODELING (package *BRepTest*)
984| Grid | Commands | Functionality |
985| :---- | :----- | :------- |
986| tol_0_01 | sewing | Sewing faces with tolerance 0.01 |
987| tol_1 | sewing | Sewing faces with tolerance 1 |
988| tol_100 | sewing | Sewing faces with tolerance 100 |
990@subsubsection testmanual_5_1_18 thrusection
992This group allows testing construction of shell or a solid passing through a set of sections in a given sequence (loft).
994| Grid | Commands | Functionality |
995| :---- | :----- | :------- |
996| solids | thrusection | Lofting with resulting solid |
997| not_solids | thrusection | Lofting with resulting shell or face |
999@subsubsection testmanual_5_1_19 xcaf
1001This group allows testing extended data exchange packages.
1003| Grid | Commands | Functionality |
1004| :---- | :----- | :------- |
1005| dxc, dxc_add_ACL, dxc_add_CL, igs_to_dxc, igs_add_ACL, brep_to_igs_add_CL, stp_to_dxc, stp_add_ACL, brep_to_stp_add_CL, brep_to_dxc, add_ACL_brep, brep_add_CL | | Subgroups are divided by format of source file, by format of result file and by type of document modification. For example, *brep_to_igs* means that the source shape in brep format was added to the document, which was saved into igs format after that. The postfix *add_CL* means that colors and layers were initialized in the document before saving and the postfix *add_ACL* corresponds to the creation of assembly and initialization of colors and layers in a document before saving. |
1008@subsection testmanual_5_2 Mapping of OCCT functionality to grid names in group *bugs*
1010| OCCT Module / Mantis category | Toolkits | Test grid in group bugs |
1011| :---------- | :--------- | :---------- |
1012| Application Framework | PTKernel, TKPShape, TKCDF, TKLCAF, TKCAF, TKBinL, TKXmlL, TKShapeSchema, TKPLCAF, TKBin, TKXml, TKPCAF, FWOSPlugin, TKStdLSchema, TKStdSchema, TKTObj, TKBinTObj, TKXmlTObj | caf |
1013| Draw | TKDraw, TKTopTest, TKViewerTest, TKXSDRAW, TKDCAF, TKXDEDRAW, TKTObjDRAW, TKQADraw, DRAWEXE, Problems of testing system | draw |
1014| Shape Healing | TKShHealing | heal |
1015| Mesh | TKMesh, TKXMesh | mesh |
1016| Data Exchange | TKIGES | iges |
1017| Data Exchange | TKSTEPBase, TKSTEPAttr, TKSTEP209, TKSTEP | step |
1018| Data Exchange | TKSTL, TKVRML | stlvrml |
1019| Data Exchange | TKXSBase, TKXCAF, TKXCAFSchema, TKXDEIGES, TKXDESTEP, TKXmlXCAF, TKBinXCAF | xde |
6268cc68 1020| Foundation Classes | TKernel, TKMath | fclasses |
504a8968 1021| Modeling_algorithms | TKGeomAlgo, TKTopAlgo, TKPrim, TKBO, TKBool, TKHLR, TKFillet, TKOffset, TKFeat, TKXMesh | modalg |
1022| Modeling Data | TKG2d, TKG3d, TKGeomBase, TKBRep | moddata |
6ce0df1e 1023| Visualization | TKService, TKV2d, TKV3d, TKOpenGl, TKMeshVS, TKNIS | vis |
504a8968 1024
5ae01c85 1026@subsection testmanual_5_3 Recommended approaches to checking test results
504a8968 1027
1028@subsubsection testmanual_5_3_1 Shape validity
1030Run command *checkshape* on the result (or intermediate) shape and make sure that *parse.rules* of the test grid or group reports bad shapes (usually recognized by word "Faulty") as error.
1034checkshape result
5ae01c85 1037To check the number of faults in the shape command *checkfaults* can be used.
1039Use: checkfaults shape source_shape [ref_value=0]
1041The default syntax of *checkfaults* command:
1043checkfaults results a_1
1046The command will check the number of faults in the source shape (*a_1*) and compare it
1047with number of faults in the resulting shape (*result*). If shape *result* contains
1048more faults, you will get an error:
1050checkfaults results a_1
1051Error : Number of faults is 5
1053It is possible to set the reference value for comparison (reference value is 4):
1056checkfaults results a_1 4
1059If number of faults in the resulting shape is unstable, reference value should be set to "-1".
1060As a result command *checkfaults* will return the following error:
1063checkfaults results a_1 -1
1064Error : Number of faults is UNSTABLE
504a8968 1067@subsubsection testmanual_5_3_2 Shape tolerance
1068The maximal tolerance of sub-shapes of each kind of the resulting shape can be extracted from output of tolerance command as follows:
1071set tolerance [tolerance result]
1072regexp { *FACE +: +MAX=([-0-9.+eE]+)} $tolerance dummy max_face
1073regexp { *EDGE +: +MAX=([-0-9.+eE]+)} $tolerance dummy max_edgee
1074regexp { *VERTEX +: +MAX=([-0-9.+eE]+)} $tolerance dummy max_vertex
5ae01c85 1077It is possible to use command *checkmaxtol* to check maximal tolerance of shape and compare it with reference value.
fb60057d 1079Use: checkmaxtol shape [options...]
5ae01c85 1080
1081Allowed options are:
fb60057d 1082 * -ref: reference value of maximum tolerance
1083 * -source: list of shapes to compare with
5ae01c85 1084 * -min_tol: minimum tolerance for comparison
1085 * -multi_tol: tolerance multiplier
5ae01c85 1087The default syntax of *checkmaxtol* command for comparison with the reference value:
fb60057d 1089checkmaxtol result -ref 0.00001
5ae01c85 1090~~~~~
1092There is an opportunity to compare max tolerance of resulting shape with max tolerance of source shape.
1093In the following example command *checkmaxtol* gets max tolerance among objects *a_1* and *a_2*.
1094Then it chooses the maximum value between founded tolerance and value -min_tol (0.000001)
1095and multiply it on the coefficient -multi_tol (i.e. 2):
fb60057d 1098checkmaxtol result -source {a_1 a_2} -min_tol 0.000001 -multi_tol 2
5ae01c85 1099~~~~~
1101If the value of maximum tolerance more than founded tolerance for comparison, the command will return an error.
fb60057d 1103Also, command *checkmaxtol* can be used to get max tolerance of the shape:
1106set maxtol [checkmaxtol result]
504a8968 1109@subsubsection testmanual_5_3_3 Shape volume, area, or length
1111Use command *vprops, sprops,* or *lprops* to correspondingly measure volume, area, or length of the shape produced by the test. The value can be extracted from the result of the command by *regexp*.
1115# check area of shape result with 1% tolerance
1116regexp {Mass +: +([-0-9.+eE]+)} [sprops result] dummy area
1117if { abs($area - $expected) > 0.1 + 0.01 * abs ($area) } {
1118 puts "Error: The area of result shape is $area, while expected $expected"
1122@subsubsection testmanual_5_3_4 Memory leaks
1124The test system measures the amount of memory used by each test case, and considerable deviations (as well as overall difference) comparing with reference results will be reported by *testdiff* command.
1126The typical approach to checking memory leak on a particular operation is to run this operation in cycle measuring memory consumption at each step and comparing it with some threshold value. Note that file begin in group bugs defines command *checktrend* that can be used to analyze a sequence of memory measurements to get statistically based evaluation of the leak presence.
1130set listmem {}
1131for {set i 1} {$i < 100} {incr i} {
1132 # run suspect operation
1134 # check memory usage (with tolerance equal to half page size)
1135 lappend listmem [expr [meminfo w] / 1024]
1136 if { [checktrend $listmem 0 256 "Memory leak detected"] } {
1137 puts "No memory leak, $i iterations"
1138 break
1139 }
1143@subsubsection testmanual_5_3_5 Visualization
936f43da 1145Take a snapshot of the viewer, give it the name of the test case, and save in the directory indicated by Tcl variable *imagedir*.
504a8968 1146
1150vdisplay result
1151vsetdispmode 1
1154vdump $imagedir/${casename}_shading.png
1157This image will be included in the HTML log produced by *testgrid* command and will be checked for non-regression through comparison of images by command *testdiff*.
5ae01c85 1158
1159@subsubsection testmanual_5_3_6 Number of free edges
1161To check the number of free edges run the command *checkfreebounds*.
1163It compares number of free edges with reference value.
1165Use: checkfreebounds shape ref_value [options...]
1167Allowed options are:
1168 * -tol N: used tolerance (default -0.01)
1169 * -type N: used type, possible values are "closed" and "opened" (default "closed")
1172checkfreebounds result 13
1175Option -tol N is used to set tolerance for command *freebounds*, which is used within command *checkfreebounds*.
1177Option -type N is used to select the type of counted free edges - closed or opened.
1179If the number of free edges in the resulting shape is unstable, reference value should be set to "-1".
1180As a result command *checkfreebounds* will return the following error:
1183checkfreebounds result -1
1184Error : Number of free edges is UNSTABLE
1187@subsubsection testmanual_5_3_7 Compare numbers
1189Procedure to check equality of two reals with some tolerance (relative and absolute)
1191Use: checkreal name value expected tol_abs tol_rel
1194checkreal "Some important value" $value 5 0.0001 0.01
1197@subsubsection testmanual_5_3_8 Check number of sub-shapes
1199Compare number of sub-shapes in "shape" with given reference data
1201Use: checknbshapes shape [options...]
1202Allowed options are:
1203 * -vertex N
1204 * -edge N
1205 * -wire N
1206 * -face N
1207 * -shell N
1208 * -solid N
1209 * -compsolid N
1210 * -compound N
1211 * -shape N
1212 * -t: compare the number of sub-shapes in "shape" counting
1213 the same sub-shapes with different location as different sub-shapes.
1214 * -m msg: print "msg" in case of error
1217checknbshapes result -vertex 8 -edge 4
1220@subsubsection testmanual_5_3_9 Check pixel color
1222To check pixel color command *checkcolor* can be used.
1224Use: checkcolor x y red green blue
1226 x y - pixel coordinates
1228 red green blue - expected pixel color (values from 0 to 1)
1230This procedure checks color with tolerance (5x5 area)
1232Next example will compare color of point with coordinates x=100 y=100 with RGB color R=1 G=0 B=0.
1233If colors are not equal, procedure will check the nearest ones points (5x5 area)
1235checkcolor 100 100 1 0 0